Process failed transfers #636
Annotations
7 errors
|
BlockValidationAssetValidTestSuite.Valid block: asset token, correct transfer:
consensus-client-it/src/test/scala/units/BlockValidationAssetValidTestSuite.scala#L15
org.scalatest.exceptions.TestFailedException: 2875820019684212736 was not equal to 3875820019684212736
|
|
BlockValidationNativeMissingDepositTestSuite.Invalid block: native token, missing deposited transaction:
consensus-client-it/src/test/scala/units/BlockValidationNativeMissingDepositTestSuite.scala#L13
org.scalatest.exceptions.TestFailedException: Can't broadcast AGYFXiPokyZR3YU4ShJ4ZX15LFc4gPev2bHnva4Z1hGN: code=306, message=Error while executing dApp: Strict C2E transfers must not be activated
|
|
BlockValidationNativeUnexpectedDepositTestSuite.Invalid block: unexpected deposited transaction:
consensus-client-it/src/test/scala/units/BlockValidationNativeUnexpectedDepositTestSuite.scala#L16
org.scalatest.exceptions.TestFailedException: Can't broadcast 6vkn7S9CuvyH41e78Rvx2LeGrWVUJ9PUbSKtg6TQL2ax: code=306, message=Error while executing dApp: Strict C2E transfers must not be activated
|
|
BlockValidationNativeUnexpectedWithdrawalTestSuite.Invalid block: native token, unexpected extra withdrawal:
consensus-client-it/src/test/scala/units/BlockValidationNativeUnexpectedWithdrawalTestSuite.scala#L16
org.scalatest.exceptions.TestFailedException: Can't broadcast 7L1FTyYQt71ZmfVXYNeTHMPPSmrBQwdZ3HDGbT24PErr: code=306, message=Error while executing dApp: Strict C2E transfers must not be activated
|
|
FailedTransfersTestSuite1.Mining continues after 2 equivalent transfers: 1 successful and 1 failed:
consensus-client-it/src/test/scala/units/FailedTransfersTestSuite1.scala#L18
org.scalatest.exceptions.TestFailedDueToTimeoutException: EL height grows The code passed to eventually never returned normally. Attempted 73 times over 1.2134614218500002 minutes. Last failure message: Probably, you have to upgrade your client. Can't read a block 0xb00be3d20174e8bd6210864dbb497c2539bdbed06e3fa0131f1f8b853cf9fca3 meta, bytes: base64:AAAAAAAAAAsAAAAAAAAACOQermaEdOlMS1hwkwvtxEGhCC/oz1Hk/J2VaNc63p+gAAAAAAAAAAAAAAAAAAAABAAAAAAAAAABb4lfARHlqtf/7+1kogAmKnPEcrTkNe4O23s7GQfgQwo=, remaining: 0.
|
|
FailedTransfersTestSuite2.Mining continues after 3 failed C2E transfers, 2 consecutive non-last and 1 last:
consensus-client-it/src/test/scala/units/FailedTransfersTestSuite2.scala#L18
org.scalatest.exceptions.TestFailedDueToTimeoutException: EL height grows The code passed to eventually never returned normally. Attempted 73 times over 1.2167147669833334 minutes. Last failure message: Probably, you have to upgrade your client. Can't read a block 0x6c1f32089ce12854ba6eeb027a535710ddbdd2ec0da0d213b1c7db2cfea968d2 meta, bytes: base64:AAAAAAAAAAsAAAAAAAAACJeDkGSBvkucNRXvJnfe+xlUplfBJWvQCc/Xbhbs4o2bAAAAAAAAAAAAAAAAAAAABQAAAAAAAAABkjSNaPxsSQa7ZS94j0cVonK3zKMp48Nufa0WnpUVNBM=, remaining: 0.
|
|
Check PR
Process completed with exit code 1.
|