Process failed transfers #635
Annotations
11 errors
|
BlockValidationAssetInvalidAmountTestSuite.Invalid block: asset token, invalid amount:
consensus-client-it/src/test/scala/units/BlockValidationAssetInvalidAmountTestSuite.scala#L15
org.scalatest.exceptions.TestFailedException: Can't broadcast 7GR7LfZc7kMF4J847242VbVdyrsDzq4JczRdyiFmcmYW: code=306, message=Error while executing dApp: Strict C2E transfers must not be activated
|
|
BlockValidationAssetInvalidBridgeTestSuite.Invalid block: asset token, invalid standardBridgeAddress:
consensus-client-it/src/test/scala/units/BlockValidationAssetInvalidBridgeTestSuite.scala#L15
org.scalatest.exceptions.TestFailedException: Can't broadcast 7cZDGDBTdidwCp1uwwxA9doQFafWAhJW2FE9CvLNH4WH: code=306, message=Error while executing dApp: Strict C2E transfers must not be activated
|
|
BlockValidationAssetInvalidRecipientTestSuite.Invalid block: asset token, invalid recipient address:
consensus-client-it/src/test/scala/units/BlockValidationAssetInvalidRecipientTestSuite.scala#L15
org.scalatest.exceptions.TestFailedException: Can't broadcast 6zefFzwByS9whWzvtqHSDF65hxio5KaD8TEvJ5y1ybfN: code=306, message=Error while executing dApp: Strict C2E transfers must not be activated
|
|
BlockValidationAssetInvalidSenderTestSuite.Invalid block: asset token, invalid sender address:
consensus-client-it/src/test/scala/units/BlockValidationAssetInvalidSenderTestSuite.scala#L13
org.scalatest.exceptions.TestFailedException: Can't broadcast CbiepUJbjWN7uvLy6sfK6kJZBpgfoQ64im6qKuis2wdb: code=306, message=Error while executing dApp: Strict C2E transfers must not be activated
|
|
BlockValidationAssetInvalidTokenTestSuite.Invalid block: asset token, invalid token address:
consensus-client-it/src/test/scala/units/BlockValidationAssetInvalidTokenTestSuite.scala#L15
org.scalatest.exceptions.TestFailedException: Can't broadcast Chdmjisw6SoaMxsDDCHg2gtnCk28RPmBiaMj74rQuH2D: code=306, message=Error while executing dApp: Strict C2E transfers must not be activated
|
|
BlockValidationNativeMissingDepositTestSuite.Invalid block: native token, missing deposited transaction:
consensus-client-it/src/test/scala/units/BlockValidationNativeMissingDepositTestSuite.scala#L13
org.scalatest.exceptions.TestFailedException: Can't broadcast 72CrAwcDvAgYL6i9AZVie4GuGN7ZKLCfbs5wsSphTyHz: code=306, message=Error while executing dApp: Strict C2E transfers must not be activated
|
|
BlockValidationNativeUnexpectedDepositTestSuite.Invalid block: unexpected deposited transaction:
consensus-client-it/src/test/scala/units/BlockValidationNativeUnexpectedDepositTestSuite.scala#L16
org.scalatest.exceptions.TestFailedException: Can't broadcast F7PA8cMdDWE491qsyPkg69C6wMNNkY9FtfFuJegW62u1: code=306, message=Error while executing dApp: Strict C2E transfers must not be activated
|
|
BlockValidationNativeUnexpectedWithdrawalTestSuite.Invalid block: native token, unexpected extra withdrawal:
consensus-client-it/src/test/scala/units/BlockValidationNativeUnexpectedWithdrawalTestSuite.scala#L16
org.scalatest.exceptions.TestFailedException: Can't broadcast 2kCBYeJqXVFS4FddFMePALVdZ9na4zYmrMkjz7DAUEvm: code=306, message=Error while executing dApp: Strict C2E transfers must not be activated
|
|
FailedTransfersTestSuite1.Mining continues after 2 equivalent transfers: 1 successful and 1 failed:
consensus-client-it/src/test/scala/units/FailedTransfersTestSuite1.scala#L18
org.scalatest.exceptions.TestFailedDueToTimeoutException: EL height grows The code passed to eventually never returned normally. Attempted 73 times over 1.2136778256666667 minutes. Last failure message: Probably, you have to upgrade your client. Can't read a block 0x973e177f14b93faca4c6683645c07f1dcc60ffe138b8fff0511560942aa6737b meta, bytes: base64:AAAAAAAAAAsAAAAAAAAACG9wsgR6wVrCNE/6g0I9XNIEC2Up7yFRXvtOsnLbo17qAAAAAAAAAAAAAAAAAAAABAAAAAAAAAABb4lfARHlqtf/7+1kogAmKnPEcrTkNe4O23s7GQfgQwo=, remaining: 0.
|
|
FailedTransfersTestSuite2.Mining continues after 3 failed C2E transfers, 2 consecutive non-last and 1 last:
consensus-client-it/src/test/scala/units/FailedTransfersTestSuite2.scala#L18
org.scalatest.exceptions.TestFailedDueToTimeoutException: EL height grows The code passed to eventually never returned normally. Attempted 72 times over 1.2012830042666667 minutes. Last failure message: Probably, you have to upgrade your client. Can't read a block 0xf10a89d4f9af382f5babe2f8329f3c7ebf3f04ced8b2cae55dc82fb922ad966c meta, bytes: base64:AAAAAAAAAAsAAAAAAAAACHZXxORNs2TKYIkIWq8sS9M66rcO1WoeIu8DvCEuv5bOAAAAAAAAAAAAAAAAAAAABQAAAAAAAAABkjSNaPxsSQa7ZS94j0cVonK3zKMp48Nufa0WnpUVNBM=, remaining: 0.
|
|
Check PR
Process completed with exit code 1.
|